Reaction Details
TargetP2X purinoceptor 3
LigandBDBM196431
Substrate/Competitorn/a
Meas. Tech.Inhibition Assay
pH7.5±n/a
IC50 2±n/a nM
Commentsextracted
Citation Kai, HEndoh, TJikihara, SHoriguchi, T Heterocyclic derivative and pharmaceutical composition comprising the same US Patent US9212130 Publication Date 12/15/2015
 
P2X purinoceptor 3
Name:P2X purinoceptor 3
Type:Protein
Mol. Mass.:44292.02
Organism:Homo sapiens (Human)
Description:P56373
Residue:397
BDBM196431
NameBDBM196431
Synonyms:US9212130, I-359
TypeSmall organic molecule
Emp. Form.C30H27ClN4O6
Mol. Mass.575.012
SMILESOC(=O)c1cccc(Oc2ccc(Nc3ncc(NC(=O)C4CCOCC4)c(=O)n3Cc3ccc(Cl)cc3)cc2)c1