Reaction Details
TargetMetabotropic glutamate receptor 5
LigandBDBM196508
Substrate/Competitorn/a
Meas. Tech.Radioligand Binding Assay
pH7.4±n/a
Temperature298.15±n/a K
Ki 4.5±n/a nM
Commentsextracted
Citation Doller, DLi, G Bicarbocyclic and tricarbocyclic ethynyl derivatives and uses of same US Patent US9212165 Publication Date 12/15/2015
 
Metabotropic glutamate receptor 5
Name:Metabotropic glutamate receptor 5
Type:Enzyme
Mol. Mass.:132484.72
Organism:Homo sapiens (Human)
Description:n/a
Residue:1212
BDBM196508
NameBDBM196508
Synonyms:US9212165, 16
TypeSmall organic molecule
Emp. Form.C21H21N3O
Mol. Mass.331.4109
SMILESO=C(N[C@]12CC[C@](C1)(CCC2)C#Cc1ccccn1)c1ccccn1