Reaction Details
TargetHistone deacetylase 6 [60-420,H82F,F202Y]
LigandBDBM198125
Substrate/Competitorn/a
Meas. Tech.HDAC6 fluorescence anisotropy assay
Temperature298.15±n/a K
Kd 2900±700 nM
Commentsextracted
Citation Hai, YUniversity of Pennsylvania,, DW Histone deacetylase 6 structure and molecular basis of catalysis and inhibition Nat Chem Biol12:741-747 (2016) 
 
Histone deacetylase 6 [60-420,H82F,F202Y]
Name:Histone deacetylase 6 [60-420,H82F,F202Y]
Type:n/a
Mol. Mass.:39799.83
Organism:Danio rerio
Description:F8W4B7[60-420,H82F,F202Y]
Residue:360
BDBM198125
NameBDBM198125
Synonyms:fl-SAHA
TypeSmall organic molecule
Emp. Form.C28H26N2O8
Mol. Mass.518.5146
SMILESONC(=O)CCCCCCC(=O)Nc1ccc(c(c1)C(O)=O)-c1c2ccc(O)cc2oc2cc(=O)ccc12