Reaction Details
TargetHistone deacetylase 6 [440-798]
LigandBDBM198122
Substrate/Competitorn/a
Meas. Tech.HDAC6 fluorescence anisotropy assay
Temperature298.15±n/a K
Ki 350±50 nM
IC50 600±90 nM
Commentsextracted
Citation Hai, YUniversity of Pennsylvania,, DW Histone deacetylase 6 structure and molecular basis of catalysis and inhibition Nat Chem Biol12:741-747 (2016) 
 
Histone deacetylase 6 [440-798]
Name:Histone deacetylase 6 [440-798]
Type:n/a
Mol. Mass.:39850.25
Organism:Danio rerio
Description:F8W4B7[440-798]
Residue:359
BDBM198122
NameBDBM198122
Synonyms:HC toxin
TypeSmall organic molecule
Emp. Form.C21H32N4O6
Mol. Mass.436.502
SMILESC[C@@H]1NC(=O)[C@H]2CCCN2C(=O)[C@H](CCCCCC(=O)[C@@H]2CO2)NC(=O)[C@@H](C)NC1=O