Reaction Details
TargetNitric oxide synthase, endothelial
LigandBDBM196648
Substrate/Competitorn/a
Meas. Tech.Inhibition Assay
pH7.4±n/a
Ki 900±n/a nM
Commentsextracted
Citation Silverman, RBCinelli, MA 2-aminoquinoline-based compounds for potent and selective neuronal nitric oxide synthase inhibition US Patent US9212144 Publication Date 12/15/2015
 
Nitric oxide synthase, endothelial
Name:Nitric oxide synthase, endothelial
Type:Enzyme
Mol. Mass.:133292.26
Organism:Bos taurus (bovine)
Description:Recombinant eNOS overexpressed in E. coli was used in enzyme assays.
Residue:1205
BDBM196648
NameBDBM196648
Synonyms:US9212144, 3 | US9242957, 65
TypeSmall organic molecule
Emp. Form.C20H20FN3S
Mol. Mass.353.456
SMILESFc1cccc(CCNCc2cccc(NC(=N)c3cccs3)c2)c1