Reaction Details
TargetD-amino-acid oxidase
LigandBDBM50431083
Substrate/Competitorn/a
Meas. Tech.Inhibition Assay
pH7.5±n/a
Temperature298.15±n/a K
IC50 1.5±n/a nM
Commentsextracted
Citation Hondo, TNakanishi, KNiimi, TWarizaya, MNamatame, IHarada, K Dihydroxy aromatic heterocyclic compound US Patent US9212147 Publication Date 12/15/2015
 
D-amino-acid oxidase
Name:D-amino-acid oxidase
Type:Homodimer
Mol. Mass.:39476.06
Organism:Homo sapiens (Human)
Description:P14920
Residue:347
BDBM50431083
NameBDBM50431083
Synonyms:CHEMBL2338803 US10463663, Example 8 US9212147, 24 US9931340, Example 8
TypeSmall organic molecule
Emp. Form.C12H10F2N2O2
Mol. Mass.252.2168
SMILESOc1cc(CCc2cc(F)cc(F)c2)n[nH]c1=O