Reaction Details
TargetD-amino-acid oxidase
LigandBDBM196671
Substrate/Competitorn/a
Meas. Tech.Inhibition Assay
pH7.5±n/a
Temperature298.15±n/a K
IC50 2.3±n/a nM
Commentsextracted
Citation Hondo, TNakanishi, KNiimi, TWarizaya, MNamatame, IHarada, K Dihydroxy aromatic heterocyclic compound US Patent US9212147 Publication Date 12/15/2015
 
D-amino-acid oxidase
Name:D-amino-acid oxidase
Type:Homodimer
Mol. Mass.:39476.06
Organism:Homo sapiens (Human)
Description:P14920
Residue:347
BDBM196671
NameBDBM196671
Synonyms:US10202399, Example 56 | US9212147, 56
TypeSmall organic molecule
Emp. Form.C16H14N2O2
Mol. Mass.266.2946
SMILESOc1cc(CCc2cccc3ccccc23)n[nH]c1=O