Reaction Details
TargetD-amino-acid oxidase
LigandBDBM196675
Substrate/Competitorn/a
Meas. Tech.Inhibition Assay
pH7.5±n/a
Temperature298.15±n/a K
IC50 2.2±n/a nM
Commentsextracted
Citation Hondo, TNakanishi, KNiimi, TWarizaya, MNamatame, IHarada, K Dihydroxy aromatic heterocyclic compound US Patent US9212147 Publication Date 12/15/2015
 
D-amino-acid oxidase
Name:D-amino-acid oxidase
Type:Homodimer
Mol. Mass.:39476.06
Organism:Homo sapiens (Human)
Description:P14920
Residue:347
BDBM196675
NameBDBM196675
Synonyms:US10202399, Example 237 | US9212147, 237
TypeSmall organic molecule
Emp. Form.C11H10N2O3
Mol. Mass.218.2087
SMILESOc1n[nH]c(COc2ccccc2)cc1=O