Reaction Details
TargetD-amino-acid oxidase
LigandBDBM196654
Substrate/Competitorn/a
Meas. Tech.Inhibition Assay
pH7.5±n/a
Temperature298.15±n/a K
IC50 2.4±n/a nM
Commentsextracted
Citation Hondo, TNakanishi, KNiimi, TWarizaya, MNamatame, IHarada, K Dihydroxy aromatic heterocyclic compound US Patent US9212147 Publication Date 12/15/2015
 
D-amino-acid oxidase
Name:D-amino-acid oxidase
Type:Homodimer
Mol. Mass.:39476.06
Organism:Homo sapiens (Human)
Description:P14920
Residue:347
BDBM196654
NameBDBM196654
Synonyms:US9212147, 1
TypeSmall organic molecule
Emp. Form.C12H10N2O2
Mol. Mass.214.22
SMILESOc1n[nH]c(\C=C\c2ccccc2)cc1=O