Reaction Details
TargetXaa-Pro aminopeptidase 2
LigandBDBM197051
Substrate/Competitorn/a
Meas. Tech.Enzyme Assay
pH7.4±n/a
IC50 3.7±n/a nM
Commentsextracted
Citation Simmons, WH 4-Fluoro-Thio-containing inhibitors of APP2, compositions thereof and method of use US Patent US9212206 Publication Date 12/15/2015
 
Xaa-Pro aminopeptidase 2
Name:Xaa-Pro aminopeptidase 2
Type:Enzyme
Mol. Mass.:75618.88
Organism:Homo sapiens (Human)
Description:O43895
Residue:674
BDBM197051
NameBDBM197051
Synonyms:US9212206, III
TypeSmall organic molecule
Emp. Form.C21H32FN3O5S
Mol. Mass.457.559
SMILESCC(C)C[C@H](S)C(=O)N1C[C@@H](F)C[C@H]1C(=O)N1CCC[C@H]1C(=O)N1CC[C@H](C1)C(O)=O