Reaction Details
TargetFatty acid-binding protein, liver
LigandBDBM60994
Substrate/Competitorn/a
Meas. Tech.FABP1 Fluorescent Ligand Displacement Assay
Ki 1.0e+3± 2e+2 nM
Citation Huang, HMcIntosh, ALMartin, GGLandrock, DChung, SLandrock, KKDangott, LJLi, SKier, ABSchroeder, F FABP1: A Novel Hepatic Endocannabinoid and Cannabinoid Binding Protein. Biochemistry55:5243-55 (2016) 
 
Fatty acid-binding protein, liver
Name:Fatty acid-binding protein, liver
Type:Protein
Mol. Mass.:14247.91
Organism:Mus musculus (Mouse)
Description:n/a
Residue:127
BDBM60994
NameBDBM60994
Synonyms:(10R,10aR)-6,6,9-Trimethyl-3-pentyl-6a,7,8,10a-tetrahydro-6H-benzo[c]chromen-1-ol 1N-[2-(5-dimethylaminomethyl-2-furylmethylsulfanyl)ethyl]-1N-methyl-2-nitro-(Z)-1-ethene-1,1-diamine 6,6,9-Trimethyl-3-pentyl-6a,7,8,10a-tetrahydro-6H-benzo[c]chromen-1-ol(DeltaE-9-THC) 8,8-Dimethyl-11-methylene-5-pentyl-3,4,8a,9,10,11,12,12a-octahydro-2H,8H-1,7-dioxa-benzo[c]phenanthrene BDBM50007391 DRONABINOL Tetrahydrocannabinol delta-9-THC delta-9-Tetrahydrocannabinol (THC) delta9-tetrahydrocannabinol
Typen/a
Emp. Form.C21H30O2
Mol. Mass.314.4617
SMILESCCCCCc1cc(O)c2[C@@H]3C=C(C)CC[C@H]3C(C)(C)Oc2c1