Reaction Details
TargetFatty acid-binding protein, liver
LigandBDBM197171
Substrate/CompetitorBDBM60927
Meas. Tech.FABP1 Fluorescent Ligand Displacement Assay
Ki 33±2 nM
Citation Huang, HMcIntosh, ALMartin, GGLandrock, DChung, SLandrock, KKDangott, LJLi, SKier, ABSchroeder, F FABP1: A Novel Hepatic Endocannabinoid and Cannabinoid Binding Protein. Biochemistry55:5243-55 (2016) 
 
Fatty acid-binding protein, liver
Name:Fatty acid-binding protein, liver
Type:Protein
Mol. Mass.:14247.91
Organism:Mus musculus (Mouse)
Description:n/a
Residue:127
BDBM197171
BDBM60927
NameBDBM197171
Synonyms:4,4,8-trimethyl-5-(3-methylbutanoyl)-4,5-dihydro-1H-[1,2]dithiolo[3,4-c]quinoline-1-thione SCPI4
TypeSmall organic molecule
Emp. Form.C18H21NOS3
Mol. Mass.363.56
SMILESCC(C)CC(=O)N1c2ccc(C)cc2-c2c(ssc2=S)C1(C)C