Reaction Details
TargetF420-dependent glucose-6-phosphate dehydrogenase [W44Y]
LigandBDBM197174
Substrate/Competitorn/a
Meas. Tech.Fluorescence Binding Assay
pH7±n/a
Kd 1.9e+4± 2e+3 nM
Commentsextracted
Citation Oyugi, MABashiri, GBaker, ENJohnson-Winters, K Investigating the Reaction Mechanism of F420-Dependent Glucose-6-phosphate Dehydrogenase from Mycobacterium tuberculosis: Kinetic Analysis of the Wild-Type and Mutant Enzymes. Biochemistry55:5566-5577 (2016) 
 
F420-dependent glucose-6-phosphate dehydrogenase [W44Y]
Name:F420-dependent glucose-6-phosphate dehydrogenase [W44Y]
Type:Protein
Mol. Mass.:36958.32
Organism:Mycobacterium tuberculosis
Description:P9WNE0[W44Y]
Residue:336
BDBM197174
NameBDBM197174
Synonyms:Glucose-6-phosphate (G6P)
TypeSmall organic molecule
Emp. Form.C6H13O9P
Mol. Mass.260.1358
SMILESO[C@H](COP(O)(O)=O)[C@H](O)[C@H](O)[C@@H](O)C=O