Reaction Details
TargetF420-dependent glucose-6-phosphate dehydrogenase [W44Y]
LigandBDBM197175
Substrate/Competitorn/a
Meas. Tech.Fluorescence Binding Assay
pH7±n/a
Kd 1170±170 nM
Commentsextracted
Citation Oyugi, MABashiri, GBaker, ENJohnson-Winters, K Investigating the Reaction Mechanism of F420-Dependent Glucose-6-phosphate Dehydrogenase from Mycobacterium tuberculosis: Kinetic Analysis of the Wild-Type and Mutant Enzymes. Biochemistry55:5566-5577 (2016) 
 
F420-dependent glucose-6-phosphate dehydrogenase [W44Y]
Name:F420-dependent glucose-6-phosphate dehydrogenase [W44Y]
Type:Protein
Mol. Mass.:36958.32
Organism:Mycobacterium tuberculosis
Description:P9WNE0[W44Y]
Residue:336
BDBM197175
NameBDBM197175
Synonyms:F420
TypeSmall organic molecule
Emp. Form.C29H36N5O18P
Mol. Mass.773.5926
SMILESC[C@H](OP(O)(=O)OC[C@@H](O)[C@@H](O)[C@@H](O)Cn1c2cc(=O)ccc2cc2c1[nH]c(=O)[nH]c2=O)C(=O)N[C@@H](CCC(=O)N[C@@H](CCC(O)=O)C(O)=O)C(O)=O