Reaction Details
TargetTyrosine-protein kinase BTK
LigandBDBM197262
Substrate/Competitorn/a
Meas. Tech.Enzymatic Activity Assay
Temperature298.15±n/a K
IC50 0.9±n/a nM
Commentsextracted
Citation Goldstein, DM Tyrosine kinase inhibitors US Patent US9090621 Publication Date 7/28/2015
 
Tyrosine-protein kinase BTK
Name:Tyrosine-protein kinase BTK
Type:Enzyme
Mol. Mass.:76289.95
Organism:Homo sapiens (Human)
Description:Q06187
Residue:659
BDBM197262
NameBDBM197262
Synonyms:US9090621, 162A | US9572811, Example 162A
TypeSmall organic molecule
Emp. Form.C33H33F3N8O3
Mol. Mass.646.6621
SMILESCC(C)(C=C(C#N)C(=O)N1CCC[C@H](C1)n1nc(-c2ccc(Oc3cccc(F)c3F)cc2F)c2c(N)ncnc12)N1CCOCC1