Reaction Details
TargetSerine/threonine-protein kinase B-raf
LigandBDBM197676
Substrate/Competitorn/a
Meas. Tech.Enzyme Assay
pH7.2±n/a
Temperature303.15±n/a K
IC50 12±n/a nM
Commentsextracted
Citation Shim, EKKim, NDShim, TBKim, SY Purinylpyridinylamino-2,4-difluorophenyl sulfonamide derivative, pharmaceutically acceptable salt thereof, preparation method thereof, and pharmaceutical composition with inhibitory activity against Raf kinase, containing same as active ingredient US Patent US9216981 Publication Date 12/22/2015
 
Serine/threonine-protein kinase B-raf
Name:Serine/threonine-protein kinase B-raf
Type:Serine/threonine-protein kinase
Mol. Mass.:84446.00
Organism:Homo sapiens (Human)
Description:P15056
Residue:766
BDBM197676
NameBDBM197676
Synonyms:US9216981, 4
TypeSmall organic molecule
Emp. Form.C20H13F2N7O2S2
Mol. Mass.485.49
SMILESFc1ccc(NS(=O)(=O)c2cccs2)c(F)c1Nc1ncccc1-c1ncnc2[nH]cnc12