Reaction Details
TargetProstaglandin G/H synthase 2
LigandBDBM198171
Substrate/Competitorn/a
Meas. Tech.In vitro COX Inhibition Assay
IC50 7.7e+2± 23 nM
Citation Banerjee, AGDas, NShengule, SASharma, PASrivastava, RSShrivastava, SK Design, synthesis, evaluation and molecular modelling studies of some novel 5,6-diphenyl-1,2,4-triazin-3(2H)-ones bearing five-member heterocyclic moieties as potential COX-2 inhibitors: A hybrid pharmacophore approach. Bioorg Chem69:102-120 (2016) 
 
Prostaglandin G/H synthase 2
Name:Prostaglandin G/H synthase 2
Type:Protein
Mol. Mass.:68976.98
Organism:Ovis aries (Sheep)
Description:n/a
Residue:603
BDBM198171
NameBDBM198171
Synonyms:2-((5-(4-Methoxyphenylamino)-1,3,4-oxadiazol-2-yl)methyl)-5,6-diphenyl-1,2,4-triazin-3(2H)-one (3c)
TypeSmall organic molecule
Emp. Form.C25H20N6O3
Mol. Mass.452.4647
SMILESCOc1ccc(Nc2nnc(Cn3nc(-c4ccccc4)c(nc3=O)-c3ccccc3)o2)cc1