Reaction Details
TargetCarboxylic ester hydrolase
LigandBDBM10404
Substrate/Competitorn/a
Meas. Tech.Cholinesterase Inhibition Assay
pH7.6±n/a
Temperature298.15±n/a K
IC50 8.8e+3± 5e+2 nM
Commentsextracted
Citation Rodríguez, YAGutiérrez, MRamírez, DAlzate-Morales, JBernal, CCGüiza, FMRomero Bohórquez, AR Novel N-allyl/propargyl tetrahydroquinolines: Synthesis via Three-component Cationic Imino Diels-Alder Reaction, Binding Prediction, and Evaluation as Cholinesterase Inhibitors. Chem Biol Drug Des88:498-510 (2016) 
 
Carboxylic ester hydrolase
Name:Carboxylic ester hydrolase
Type:Protein
Mol. Mass.:68842.83
Organism:Equus caballus (Horse)
Description:Q9N1N9
Residue:602
BDBM10404
NameBDBM10404
Synonyms:(1S,12S,14R)-9-methoxy-4-methyl-11-oxa-4-azatetracyclo[8.6.1.0^{1,12}.0^{6,17}]heptadeca-6,8,10(17),15-tetraen-14-ol GALANTAMINE HYDROBROMIDE Galanthamine Lycoremine Nivaline Reminyl US9586925, Galantamine | galantamine
TypeSmall organic molecule
Emp. Form.C17H21NO3
Mol. Mass.287.3535
SMILESCOc1ccc2CN(C)CC[C@@]34C=C[C@H](O)C[C@@H]3Oc1c24