Reaction Details
TargetGlutamate receptor ionotropic, NMDA 2B
LigandBDBM198697
Substrate/Competitorn/a
Meas. Tech.Radioligand Binding Assay
Temperature323.15±n/a K
Ki 5.3±n/a nM
Commentsextracted
Citation King, DThompson, III, LAShi, JThangathirupathy, SWarrier, JSIslam, IMacor, JE Selective NR2B antagonists US Patent US9221796 Publication Date 12/29/2015
 
Glutamate receptor ionotropic, NMDA 2B
Name:Glutamate receptor ionotropic, NMDA 2B
Type:Protein
Mol. Mass.:166077.66
Organism:Rattus norvegicus (Rat)
Description:Q00960
Residue:1482
BDBM198697
NameBDBM198697
Synonyms:US9221796, 25b
TypeSmall organic molecule
Emp. Form.C22H26N2O3
Mol. Mass.366.4534
SMILESOc1ccc(CN2CC[C@@H](N3CCC(CC3)c3ccc(O)cc3)C2=O)cc1