Reaction Details
TargetGlutamate receptor ionotropic, NMDA 2B
LigandBDBM198743
Substrate/Competitorn/a
Meas. Tech.Radioligand Binding Assay
Temperature323.15±n/a K
Ki 11±n/a nM
Commentsextracted
Citation King, DThompson, III, LAShi, JThangathirupathy, SWarrier, JSIslam, IMacor, JE Selective NR2B antagonists US Patent US9221796 Publication Date 12/29/2015
 
Glutamate receptor ionotropic, NMDA 2B
Name:Glutamate receptor ionotropic, NMDA 2B
Type:Protein
Mol. Mass.:166077.66
Organism:Rattus norvegicus (Rat)
Description:Q00960
Residue:1482
BDBM198743
NameBDBM198743
Synonyms:BDBM198744 BDBM198746 | US9221796, 51, P-1
TypeSmall organic molecule
Emp. Form.C23H26F2N2O2
Mol. Mass.400.4615
SMILESCc1ccc(CN2CCC(N3CCC(c4ccc(O)cc4)C(F)(F)C3)C2=O)cc1