Reaction Details
TargetGlutamate receptor ionotropic, NMDA 2B
LigandBDBM198783
Substrate/Competitorn/a
Meas. Tech.Radioligand Binding Assay
Temperature323.15±n/a K
Ki 8±n/a nM
Commentsextracted
Citation King, DThompson, III, LAShi, JThangathirupathy, SWarrier, JSIslam, IMacor, JE Selective NR2B antagonists US Patent US9221796 Publication Date 12/29/2015
 
Glutamate receptor ionotropic, NMDA 2B
Name:Glutamate receptor ionotropic, NMDA 2B
Type:Protein
Mol. Mass.:166077.66
Organism:Rattus norvegicus (Rat)
Description:Q00960
Residue:1482
BDBM198783
NameBDBM198783
Synonyms:US9221796, 75
TypeSmall organic molecule
Emp. Form.C22H25FN2O2
Mol. Mass.368.4445
SMILESOc1ccc(cc1)[C@H]1CCN(C[C@@H]1F)[C@@H]1CCN(Cc2ccccc2)C1=O