Reaction Details
TargetGlutamate receptor ionotropic, NMDA 2B
LigandBDBM198805
Substrate/Competitorn/a
Meas. Tech.Radioligand Binding Assay
Temperature323.15±n/a K
Ki 12±n/a nM
Commentsextracted
Citation King, DThompson, III, LAShi, JThangathirupathy, SWarrier, JSIslam, IMacor, JE Selective NR2B antagonists US Patent US9221796 Publication Date 12/29/2015
 
Glutamate receptor ionotropic, NMDA 2B
Name:Glutamate receptor ionotropic, NMDA 2B
Type:Protein
Mol. Mass.:166077.66
Organism:Rattus norvegicus (Rat)
Description:Q00960
Residue:1482
BDBM198805
NameBDBM198805
Synonyms:BDBM198821 | US9221796, 95, P-2
TypeSmall organic molecule
Emp. Form.C22H23ClF2N2O2
Mol. Mass.420.88
SMILESOc1ccc(cc1)C1CCN(CC1(F)F)[C@@H]1CCN(Cc2ccc(Cl)cc2)C1=O