Reaction Details
TargetGlutamate receptor ionotropic, NMDA 2B
LigandBDBM198814
Substrate/Competitorn/a
Meas. Tech.Radioligand Binding Assay
Temperature323.15±n/a K
Ki 11±n/a nM
Commentsextracted
Citation King, DThompson, III, LAShi, JThangathirupathy, SWarrier, JSIslam, IMacor, JE Selective NR2B antagonists US Patent US9221796 Publication Date 12/29/2015
 
Glutamate receptor ionotropic, NMDA 2B
Name:Glutamate receptor ionotropic, NMDA 2B
Type:Protein
Mol. Mass.:166077.66
Organism:Rattus norvegicus (Rat)
Description:Q00960
Residue:1482
BDBM198814
NameBDBM198814
Synonyms:US9221796, 101, P-2
TypeSmall organic molecule
Emp. Form.C22H21ClF4N2O3
Mol. Mass.472.86
SMILESOc1ccc(cc1)C1CCN(CC1(F)F)[C@@H]1CCN(C1=O)c1ccc(OC(F)F)c(Cl)c1