Reaction Details
TargetGlutamate receptor ionotropic, NMDA 2B
LigandBDBM198829
Substrate/Competitorn/a
Meas. Tech.Radioligand Binding Assay
Temperature323.15±n/a K
Ki 8.4±n/a nM
Commentsextracted
Citation King, DThompson, III, LAShi, JThangathirupathy, SWarrier, JSIslam, IMacor, JE Selective NR2B antagonists US Patent US9221796 Publication Date 12/29/2015
 
Glutamate receptor ionotropic, NMDA 2B
Name:Glutamate receptor ionotropic, NMDA 2B
Type:Protein
Mol. Mass.:166077.66
Organism:Rattus norvegicus (Rat)
Description:Q00960
Residue:1482
BDBM198829
NameBDBM198829
Synonyms:BDBM198830 | US9221796, 112, P-1
TypeSmall organic molecule
Emp. Form.C23H27FN2O2
Mol. Mass.382.4711
SMILESCc1ccc(CN2CCC(N3CC[C@@H]([C@H](F)C3)c3ccc(O)cc3)C2=O)cc1