Reaction Details
TargetGlutamate receptor ionotropic, NMDA 2B
LigandBDBM198834
Substrate/Competitorn/a
Meas. Tech.Radioligand Binding Assay
Temperature323.15±n/a K
Ki 2.7±n/a nM
Commentsextracted
Citation King, DThompson, III, LAShi, JThangathirupathy, SWarrier, JSIslam, IMacor, JE Selective NR2B antagonists US Patent US9221796 Publication Date 12/29/2015
 
Glutamate receptor ionotropic, NMDA 2B
Name:Glutamate receptor ionotropic, NMDA 2B
Type:Protein
Mol. Mass.:166077.66
Organism:Rattus norvegicus (Rat)
Description:Q00960
Residue:1482
BDBM198834
NameBDBM198834
Synonyms:US9221796, 115
TypeSmall organic molecule
Emp. Form.C23H26F2N2O2
Mol. Mass.400.4615
SMILESCc1ccc(CN2CC[C@@H](N3CC[C@H]([C@H](F)C3)c3ccc(O)c(F)c3)C2=O)cc1