Reaction Details
TargetKappa-type opioid receptor
LigandBDBM199346
Substrate/Competitorn/a
Meas. Tech.Radioligand Dose-Displacement Binding Assay
pH7.4±n/a
Ki 0.09±0.02 nM
Commentsextracted
Citation Kyle, DJTafesse, L Buprenorphine analogs US Patent US9221831 Publication Date 12/29/2015
 
Kappa-type opioid receptor
Name:Kappa-type opioid receptor
Type:G Protein-Coupled Receptor (GPCR)
Mol. Mass.:42648.76
Organism:Homo sapiens (Human)
Description:P41145
Residue:380
BDBM199346
NameBDBM199346
Synonyms:US9221831, 11
TypeSmall organic molecule
Emp. Form.C33H37N3O4
Mol. Mass.539.6646
SMILESCO[C@]12CC[C@@]3(C[C@@H]1COc1ccc(cc1)-n1ccnc1)[C@H]1Cc4ccc(O)c5O[C@@H]2[C@]3(CCN1CC1CC1)c45