Reaction Details
TargetKappa-type opioid receptor
LigandBDBM199404
Substrate/Competitorn/a
Meas. Tech.Radioligand Dose-Displacement Binding Assay
pH7.4±n/a
Ki 0.07±0.01 nM
Commentsextracted
Citation Kyle, DJTafesse, L Buprenorphine analogs US Patent US9221831 Publication Date 12/29/2015
 
Kappa-type opioid receptor
Name:Kappa-type opioid receptor
Type:G Protein-Coupled Receptor (GPCR)
Mol. Mass.:42648.76
Organism:Homo sapiens (Human)
Description:P41145
Residue:380
BDBM199404
NameBDBM199404
Synonyms:US9221831, 69
TypeSmall organic molecule
Emp. Form.C32H36N2O3
Mol. Mass.496.6398
SMILESCO[C@]12CC[C@@]3(C[C@@H]1COCc1ccccc1)[C@H]1Cc4ccc(C#N)c5O[C@@H]2[C@]3(CCN1CC1CC1)c45