Reaction Details
TargetKappa-type opioid receptor
LigandBDBM199410
Substrate/Competitorn/a
Meas. Tech.Radioligand Dose-Displacement Binding Assay
pH7.4±n/a
Ki 0.014±0.04 nM
Commentsextracted
Citation Kyle, DJTafesse, L Buprenorphine analogs US Patent US9221831 Publication Date 12/29/2015
 
Kappa-type opioid receptor
Name:Kappa-type opioid receptor
Type:G Protein-Coupled Receptor (GPCR)
Mol. Mass.:42648.76
Organism:Homo sapiens (Human)
Description:P41145
Residue:380
BDBM199410
NameBDBM199410
Synonyms:US9221831, 75
TypeSmall organic molecule
Emp. Form.C32H38N2O5
Mol. Mass.530.6545
SMILESCO[C@]12CC[C@@]3(C[C@@H]1COCc1ccc(cc1)C(N)=O)[C@H]1Cc4ccc(O)c5O[C@@H]2[C@]3(CCN1CC1CC1)c45