Reaction Details
TargetDelta-type opioid receptor
LigandBDBM199350
Substrate/Competitorn/a
Meas. Tech.Radioligand Dose-Displacement Binding Assay
pH7.4±n/a
Temperature298.15±n/a K
Ki 194.89±26.97 nM
Commentsextracted
Citation Kyle, DJTafesse, L Buprenorphine analogs US Patent US9221831 Publication Date 12/29/2015
 
Delta-type opioid receptor
Name:Delta-type opioid receptor
Type:G Protein-Coupled Receptor (GPCR)
Mol. Mass.:40382.98
Organism:Homo sapiens (Human)
Description:Competition binding assays were carried out using membrane preparations from transfected HN9.10 cells that constitutively expressed the delta opioid receptor.
Residue:372
BDBM199350
NameBDBM199350
Synonyms:US9221831, 15
TypeSmall organic molecule
Emp. Form.C31H36FNO3
Mol. Mass.489.6208
SMILESCO[C@]12CC[C@@]3(C[C@@H]1COCc1ccccc1)[C@H]1Cc4ccc(F)c5O[C@@H]2[C@]3(CCN1CC1CC1)c45