Reaction Details
TargetOpioid growth factor receptor-like protein 1
LigandBDBM199337
Substrate/Competitorn/a
Meas. Tech.Functional Assay
pH7.4±n/a
Temperature323.15±n/a K
EC50 4103.76±413.97 nM
Commentsextracted
Citation Kyle, DJTafesse, L Buprenorphine analogs US Patent US9221831 Publication Date 12/29/2015
 
Opioid growth factor receptor-like protein 1
Name:Opioid growth factor receptor-like protein 1
Type:Protein
Mol. Mass.:51247.53
Organism:Homo sapiens (Human)
Description:Q5TC84
Residue:451
BDBM199337
NameBDBM199337
Synonyms:US9221831, 1
TypeSmall organic molecule
Emp. Form.C31H39NO5
Mol. Mass.505.6451
SMILESCO[C@]12CC[C@@]3(C[C@@H]1COCc1ccccc1C)[C@H]1Cc4ccc(OCCO)c5O[C@@H]2[C@]3(CCN1C)c45