Reaction Details
TargetOpioid growth factor receptor-like protein 1
LigandBDBM199339
Substrate/Competitorn/a
Meas. Tech.Functional Assay
pH7.4±n/a
Temperature323.15±n/a K
EC50 6545.64±1031.51 nM
Commentsextracted
Citation Kyle, DJTafesse, L Buprenorphine analogs US Patent US9221831 Publication Date 12/29/2015
 
Opioid growth factor receptor-like protein 1
Name:Opioid growth factor receptor-like protein 1
Type:Protein
Mol. Mass.:51247.53
Organism:Homo sapiens (Human)
Description:Q5TC84
Residue:451
BDBM199339
NameBDBM199339
Synonyms:US9221831, 3
TypeSmall organic molecule
Emp. Form.C30H35NO3
Mol. Mass.457.6038
SMILESCO[C@]12CC[C@@]3(C[C@@H]1COCc1ccccc1)[C@H]1Cc4ccc(C=C)c5O[C@@H]2[C@]3(CCN1C)c45