Reaction Details
TargetOpioid growth factor receptor-like protein 1
LigandBDBM4203
Substrate/Competitorn/a
Meas. Tech.Functional Assay
pH7.4±n/a
Temperature323.15±n/a K
EC50 1642.40±176.72 nM
Commentsextracted
Citation Kyle, DJTafesse, L Buprenorphine analogs US Patent US9221831 Publication Date 12/29/2015
 
Opioid growth factor receptor-like protein 1
Name:Opioid growth factor receptor-like protein 1
Type:Protein
Mol. Mass.:51247.53
Organism:Homo sapiens (Human)
Description:Q5TC84
Residue:451
BDBM4203
NameBDBM4203
Synonyms:US8530494, 6 | US9221831, 10
Typen/a
Emp. Form.C32H39NO4
Mol. Mass.501.6564
SMILESCOc1ccc2C[C@H]3N(CC4CC4)CC[C@@]45[C@@H](Oc1c24)[C@]1(CC[C@@]35C[C@@H]1COCc1ccccc1)OC