Reaction Details
TargetOpioid growth factor receptor-like protein 1
LigandBDBM199353
Substrate/Competitorn/a
Meas. Tech.Functional Assay
pH7.4±n/a
Temperature323.15±n/a K
EC50 7890.2±389.03 nM
Commentsextracted
Citation Kyle, DJTafesse, L Buprenorphine analogs US Patent US9221831 Publication Date 12/29/2015
 
Opioid growth factor receptor-like protein 1
Name:Opioid growth factor receptor-like protein 1
Type:Protein
Mol. Mass.:51247.53
Organism:Homo sapiens (Human)
Description:Q5TC84
Residue:451
BDBM199353
NameBDBM199353
Synonyms:US9221831, 18
TypeSmall organic molecule
Emp. Form.C28H33NO4
Mol. Mass.447.5659
SMILESCOc1ccc2C[C@H]3NCC[C@@]45[C@@H](Oc1c24)[C@]1(CC[C@@]35C[C@@H]1COCc1ccccc1)OC