Reaction Details
TargetOpioid growth factor receptor-like protein 1
LigandBDBM199357
Substrate/Competitorn/a
Meas. Tech.Functional Assay
pH7.4±n/a
Temperature323.15±n/a K
EC50 2440.53±310.95 nM
Commentsextracted
Citation Kyle, DJTafesse, L Buprenorphine analogs US Patent US9221831 Publication Date 12/29/2015
 
Opioid growth factor receptor-like protein 1
Name:Opioid growth factor receptor-like protein 1
Type:Protein
Mol. Mass.:51247.53
Organism:Homo sapiens (Human)
Description:Q5TC84
Residue:451
BDBM199357
NameBDBM199357
Synonyms:US9221831, 22
TypeSmall organic molecule
Emp. Form.C27H31NO4
Mol. Mass.433.5393
SMILESCO[C@]12CC[C@@]3(C[C@@H]1COCc1ccccc1)[C@H]1Cc4ccc(O)c5O[C@@H]2[C@]3(CCN1)c45