Reaction Details
TargetOpioid growth factor receptor-like protein 1
LigandBDBM199363
Substrate/Competitorn/a
Meas. Tech.Functional Assay
pH7.4±n/a
Temperature323.15±n/a K
EC50 1224.72±121.55 nM
Commentsextracted
Citation Kyle, DJTafesse, L Buprenorphine analogs US Patent US9221831 Publication Date 12/29/2015
 
Opioid growth factor receptor-like protein 1
Name:Opioid growth factor receptor-like protein 1
Type:Protein
Mol. Mass.:51247.53
Organism:Homo sapiens (Human)
Description:Q5TC84
Residue:451
BDBM199363
NameBDBM199363
Synonyms:US9221831, 28
TypeSmall organic molecule
Emp. Form.C32H40N2O3
Mol. Mass.500.6716
SMILESCOc1ccc2C[C@H]3N(CC4CC4)CC[C@@]45[C@@H](Oc1c24)[C@]1(CC[C@@]35C[C@@H]1CNCc1ccccc1)OC