Reaction Details
TargetMu-type opioid receptor
LigandBDBM199404
Substrate/Competitorn/a
Meas. Tech.Functional Assay
pH7.4±n/a
Temperature298.15±n/a K
EC50 215.37±47.87 nM
Commentsextracted
Citation Kyle, DJTafesse, L Buprenorphine analogs US Patent US9221831 Publication Date 12/29/2015
 
Mu-type opioid receptor
Name:Mu-type opioid receptor
Type:G Protein-Coupled Receptor (GPCR)
Mol. Mass.:44789.51
Organism:Homo sapiens (Human)
Description:P35372
Residue:400
BDBM199404
NameBDBM199404
Synonyms:US9221831, 69
TypeSmall organic molecule
Emp. Form.C32H36N2O3
Mol. Mass.496.6398
SMILESCO[C@]12CC[C@@]3(C[C@@H]1COCc1ccccc1)[C@H]1Cc4ccc(C#N)c5O[C@@H]2[C@]3(CCN1CC1CC1)c45