Reaction Details
TargetKallikrein-1
LigandBDBM200027
Substrate/Competitorn/a
Meas. Tech.In Vitro Inhibition Assay
IC50 1600±n/a nM
Citation Evans, DMDavie, RLEdwards, HJRooker, DP Benzylamine derivatives as inhibitors of plasma kallikrein US Patent US9234000 Publication Date 1/12/2016
 
Kallikrein-1
Name:Kallikrein-1
Type:Enzyme
Mol. Mass.:28874.69
Organism:Homo sapiens (Human)
Description:P06870
Residue:262
BDBM200027
NameBDBM200027
Synonyms:US9234000, 18
TypeSmall organic molecule
Emp. Form.C27H27Cl2F3N4O2
Mol. Mass.567.43
SMILESNCc1ccc(CNC(=O)[C@H](Cc2ccc(Cl)c(Cl)c2)NC(=O)[C@H](N)Cc2ccc(cc2)C(F)(F)F)cc1