Reaction Details
TargetELAV-like protein 1 [I180A]
LigandBDBM200223
Substrate/Competitorn/a
IC50 14700±n/a nM
Citation PubChem, PC Identify HuR specific inhibitors PubChem Bioassay(2015)[AID]
 
ELAV-like protein 1 [I180A]
Name:ELAV-like protein 1 [I180A]
Type:Enzyme Catalytic Domain
Mol. Mass.:36072.53
Organism:Homo sapiens (Human)
Description:gi_1022961
Residue:326
BDBM200223
NameBDBM200223
Synonyms:cid_3034178
TypeSmall organic molecule
Emp. Form.C17H18N2O3S2
Mol. Mass.362.466
SMILESCC1=CC(C)(C)NC(=S)N1c1cccc2cc(ccc12)S(O)(=O)=O