Reaction Details
TargetELAV-like protein 1 [I180A]
LigandBDBM54386
Substrate/Competitorn/a
IC50 97400±n/a nM
Citation PubChem, PC Identify HuR specific inhibitors PubChem Bioassay(2015)[AID]
 
ELAV-like protein 1 [I180A]
Name:ELAV-like protein 1 [I180A]
Type:Enzyme Catalytic Domain
Mol. Mass.:36072.53
Organism:Homo sapiens (Human)
Description:gi_1022961
Residue:326
BDBM54386
NameBDBM54386
Synonyms:1-hydroxy-N-(3-nitrophenyl)-2-naphthalenecarboxamide 1-hydroxy-N-(3-nitrophenyl)naphthalene-2-carboxamide N-(3-nitrophenyl)-1-oxidanyl-naphthalene-2-carboxamide cid_242249
TypeSmall organic molecule
Emp. Form.C17H12N2O4
Mol. Mass.308.2882
SMILESOc1c(ccc2ccccc12)C(=O)Nc1cccc(c1)[N+]([O-])=O