Reaction Details
TargetELAV-like protein 1 [I180A]
LigandBDBM200224
Substrate/Competitorn/a
IC50 16700±n/a nM
Citation PubChem, PC Identify HuR specific inhibitors PubChem Bioassay(2015)[AID]
 
ELAV-like protein 1 [I180A]
Name:ELAV-like protein 1 [I180A]
Type:Enzyme Catalytic Domain
Mol. Mass.:36072.53
Organism:Homo sapiens (Human)
Description:gi_1022961
Residue:326
BDBM200224
NameBDBM200224
Synonyms:cid_247668
TypeSmall organic molecule
Emp. Form.C10H6Cl2N2O6S
Mol. Mass.353.135
SMILESOC(=O)C1=NN(C(=O)C1)c1cc(Cl)c(cc1Cl)S(O)(=O)=O