Reaction Details
TargetELAV-like protein 1 [I180A]
LigandBDBM200225
Substrate/Competitorn/a
IC50 2700±n/a nM
Citation PubChem, PC Identify HuR specific inhibitors PubChem Bioassay(2015)[AID]
 
ELAV-like protein 1 [I180A]
Name:ELAV-like protein 1 [I180A]
Type:Enzyme Catalytic Domain
Mol. Mass.:36072.53
Organism:Homo sapiens (Human)
Description:gi_1022961
Residue:326
BDBM200225
NameBDBM200225
Synonyms:cid_5992379
TypeSmall organic molecule
Emp. Form.C11H12AsN5O4S
Mol. Mass.385.231
SMILESCSC1=NC(=O)\C(=N/Nc2ccc(cc2)[As](O)(O)=O)C(N)=N1