Reaction Details
TargetELAV-like protein 1 [I180A]
LigandBDBM89219
Substrate/Competitorn/a
IC50 69600±n/a nM
Citation PubChem, PC Identify HuR specific inhibitors PubChem Bioassay(2015)[AID]
 
ELAV-like protein 1 [I180A]
Name:ELAV-like protein 1 [I180A]
Type:Enzyme Catalytic Domain
Mol. Mass.:36072.53
Organism:Homo sapiens (Human)
Description:gi_1022961
Residue:326
BDBM89219
NameBDBM89219
Synonyms:MLS002707303 cid_276150
TypeSmall organic molecule
Emp. Form.C22H23N3O7
Mol. Mass.441.4339
SMILES[H]C12CC3([H])C4C5NC6=C(C(=O)C(=O)C=C6C15CCN2CC3=CCOC4CC(=O)OC)[N+]([O-])=O