Reaction Details
TargetBeta-2 adrenergic receptor
LigandBDBM200747
Substrate/Competitorn/a
Meas. Tech.Adrenergic Receptor Binding Assay
Temperature298.15±n/a K
IC50 2.2±n/a nM
Commentsextracted
Citation Aiguade Bosch, JGual Roig, SPrat Quinones, MPuig Duran, C Cyclohexylamine derivatives having β2 adrenergic agonist and M3 muscarinic antagonist activities US Patent US9233108 Publication Date 1/12/2016
 
Beta-2 adrenergic receptor
Name:Beta-2 adrenergic receptor
Type:n/a
Mol. Mass.:46461.69
Organism:Homo sapiens (Human)
Description:P07550
Residue:413
BDBM200747
NameBDBM200747
Synonyms:US9233108, 9 | US9757383, Example 9
TypeSmall organic molecule
Emp. Form.C41H44ClN5O8S2
Mol. Mass.834.4
SMILESCOc1cc(-c2noc(CCCN(C)[C@H]3CC[C@@H](CC3)OC(=O)C(O)(c3cccs3)c3cccs3)n2)c(Cl)cc1CNC[C@H](O)c1ccc(O)c2[nH]c(=O)ccc12