Reaction Details
TargetBeta-2 adrenergic receptor
LigandBDBM200753
Substrate/Competitorn/a
Meas. Tech.Adrenergic Receptor Binding Assay
Temperature298.15±n/a K
IC50 1.4±n/a nM
Commentsextracted
Citation Aiguade Bosch, JGual Roig, SPrat Quinones, MPuig Duran, C Cyclohexylamine derivatives having β2 adrenergic agonist and M3 muscarinic antagonist activities US Patent US9233108 Publication Date 1/12/2016
 
Beta-2 adrenergic receptor
Name:Beta-2 adrenergic receptor
Type:n/a
Mol. Mass.:46461.69
Organism:Homo sapiens (Human)
Description:P07550
Residue:413
BDBM200753
NameBDBM200753
Synonyms:US9233108, 18 | US9757383, Example 18
TypeSmall organic molecule
Emp. Form.C38H48N6O7S
Mol. Mass.732.889
SMILESCN(CCCn1nnc2cc(CNC[C@H](O)c3ccc(O)c4NC(=O)COc34)ccc12)[C@H]1CC[C@@H](CC1)OC(=O)[C@@](O)(C1CCCC1)c1cccs1