Reaction Details
TargetMuscarinic acetylcholine receptor M3
LigandBDBM200750
Substrate/Competitorn/a
Meas. Tech.Muscarinic Receptor Binding Assay
IC50 1±n/a nM
Citation Aiguade Bosch, JGual Roig, SPrat Quinones, MPuig Duran, C Cyclohexylamine derivatives having β2 adrenergic agonist and M3 muscarinic antagonist activities US Patent US9233108 Publication Date 1/12/2016
 
Muscarinic acetylcholine receptor M3
Name:Muscarinic acetylcholine receptor M3
Type:Enzyme
Mol. Mass.:66151.03
Organism:Homo sapiens (Human)
Description:P20309
Residue:590
BDBM200750
NameBDBM200750
Synonyms:US9233108, 15 | US9757383, Example 15
TypeSmall organic molecule
Emp. Form.C44H46N4O8
Mol. Mass.758.858
SMILESCN(CCCn1c2ccc(CNC[C@H](O)c3ccc(O)c4[nH]c(=O)ccc34)cc2oc1=O)[C@H]1CC[C@@H](CC1)OC(=O)C1(C)c2ccccc2Oc2ccccc12