Reaction Details
TargetSodium- and chloride-dependent glycine transporter 1
LigandBDBM202230
Substrate/Competitorn/a
Meas. Tech.Radioligand Binding Assay
Ki<1±n/a nM
Citation Pohlki, FLange, UAmberg, WOchse, MBehl, BHornberger, WMezler, MHutchins, CWTurner, S Phenalkylamine derivatives, pharmaceutical compositions containing them, and their use in therapy US Patent US9238619 Publication Date 1/19/2016
 
Sodium- and chloride-dependent glycine transporter 1
Name:Sodium- and chloride-dependent glycine transporter 1
Type:Enzyme
Mol. Mass.:78270.54
Organism:Homo sapiens (Human)
Description:P48067
Residue:706
BDBM202230
NameBDBM202230
Synonyms:US9238619, 1
TypeSmall organic molecule
Emp. Form.C21H25FN4O3S
Mol. Mass.432.512
SMILESCn1cnc(c1)S(=O)(=O)NCCOc1ccc(F)c(c1)C(CN)Cc1ccccc1