Reaction Details
TargetSodium- and chloride-dependent glycine transporter 1
LigandBDBM202356
Substrate/Competitorn/a
Meas. Tech.Radioligand Binding Assay
Ki<0.1±n/a nM
Citation Pohlki, FLange, UAmberg, WOchse, MBehl, BHornberger, WMezler, MHutchins, CWTurner, S Phenalkylamine derivatives, pharmaceutical compositions containing them, and their use in therapy US Patent US9238619 Publication Date 1/19/2016
 
Sodium- and chloride-dependent glycine transporter 1
Name:Sodium- and chloride-dependent glycine transporter 1
Type:Enzyme
Mol. Mass.:78270.54
Organism:Homo sapiens (Human)
Description:P48067
Residue:706
BDBM202356
NameBDBM202356
Synonyms:US9238619, 73
TypeSmall organic molecule
Emp. Form.C25H32N4O4S
Mol. Mass.484.611
SMILESCOCCN1CC(Cc2ccccc2)(C1)c1cccc(OCCNS(=O)(=O)c2cn(C)cn2)c1