Reaction Details
TargetAcetylcholinesterase
LigandBDBM202363
Substrate/Competitorn/a
Meas. Tech.Inhibition Assay
pH8±n/a
Temperature298.15±n/a K
IC50 3.6±0.2 nM
Commentsextracted
Citation Muñoz-Torrero López-Ibarra, DInestrosa Cantín, NMViayna Gaza, ESola Lao, IVázquez Cruz, S Beta-amyloid-directed multitarget compounds for the treatment of alzheimer's disease US Patent US9238626 Publication Date 1/19/2016
 
Acetylcholinesterase
Name:Acetylcholinesterase
Type:Enzyme
Mol. Mass.:67792.70
Organism:Homo sapiens (Human)
Description:P22303
Residue:614
BDBM202363
NameBDBM202363
Synonyms:US9238626, (+/-)-(Ib) HCl
TypeSmall organic molecule
Emp. Form.C41H42ClN3O5
Mol. Mass.692.242
SMILESCC1=CC2CC(C1)c1c(C2)nc2cc(Cl)ccc2c1NCCCCCCCCCNC(=O)c1cc(O)c2C(=O)c3c(O)cccc3C(=O)c2c1