Reaction Details
TargetVascular endothelial growth factor receptor 3
LigandBDBM202409
Substrate/Competitorn/a
Meas. Tech.VEGFR3 Biochemical Assay
pH7.4±n/a
IC50 1±n/a nM
Commentsextracted
Citation Foitzik, RCMorrow, BJHemley, CFLunniss, GECamerino, MAGaname, DStupple, PALessene, RKersten, WJHarvey, AJHolmes, IP VEGFR3 inhibitors US Patent US9238644 Publication Date 1/19/2016
 
Vascular endothelial growth factor receptor 3
Name:Vascular endothelial growth factor receptor 3
Type:Protein
Mol. Mass.:152749.58
Organism:Homo sapiens (Human)
Description:P35916-2
Residue:1363
BDBM202409
NameBDBM202409
Synonyms:US9238644, 16
TypeSmall organic molecule
Emp. Form.C27H31ClN6O
Mol. Mass.491.028
SMILESCN1CCC(CC1)c1ccc(Nc2ncc(Cl)c(CCc3ccccc3C3(CC3)C(N)=O)n2)cn1