Reaction Details
TargetSerine/threonine-protein kinase/endoribonuclease IRE1
LigandBDBM111010
Substrate/Competitorn/a
Meas. Tech.In Vitro Enzyme Assay
pH7.5±n/a
IC50 1300±n/a nM
Commentsextracted
Citation Patterson, JBLonergan, DGFlynn, GAZeng, QPallai, PV IRE-1α inhibitors US Patent US9241942 Publication Date 1/26/2016
 
Serine/threonine-protein kinase/endoribonuclease IRE1
Name:Serine/threonine-protein kinase/endoribonuclease IRE1
Type:Enzyme
Mol. Mass.:109731.20
Organism:Homo sapiens (Human)
Description:O75460
Residue:977
BDBM111010
NameBDBM111010
Synonyms:US8614253, 3-41 US9963434, Compound 3-41
TypeSmall organic molecule
Emp. Form.C7H4BrClO2
Mol. Mass.235.462
SMILESOc1c(Br)cc(Cl)cc1C=O